{"text_format":"1","workbook":"xlsx","n_sheets":5,"sheets":["Inleiding","Gegevens","Resultaten I","Resultaten II","Tarieven"],"not_rendered":{"charts":0,"images":3,"macros":1,"external_links":0,"defined_names":66,"comments":0,"pivot_tables":0},"unopened":[],"bounds":{"document_bytes":16777216,"sheet_cells":100000,"rows_first":2000,"rows_last":500,"rows_between":2000,"halvings":0,"cell_chars":16384,"cell_head_chars":4096},"cells_cut":0,"cells_raw":0,"read":"whole","date_system":"1900"}

{"sheet":"Inleiding","index":0,"n_rows":48,"n_cols":4,"rows_kept":48,"cut":false,"hidden":false,"merged":[]}
[]
[]
[]
[]
[]
[]
[null,null,null,"Voor het optimale werking van dit bestand, gelieve het eerst te downloaden alvorens gebruik."]
[]
[null,null,null,"Deze simulator heeft tot doel bijkomende informatie te verschaffen aan de marktspelers met betrekking"]
[null,null,null,"tot de toepassingsmodaliteiten van de tarieven voor toegang tot het net (*), de tarieven voor "]
[null,null,null,"openbare dienstverplichtingen en de toeslagen. Wat niet beoogd wordt met dit programma: "]
[null,null,null,"de aansluitingstarieven en de tarieven voor compensatie van kwartier-onevenwichten."]
[]
[null,null,null,"Het simulatie-programma illustreert de berekening van de bedragen met betrekking tot de toegang tot"]
[null,null,null,"het Elia-net door netgebruikers die hierop aangesloten zijn. Het houdt bovendien rekening met de regio"]
[null,null,null,"waarbinnen het betrokken toegangspunt gesitueerd is, het infrastructuurniveau en het type toegangspunt."]
[]
[null,null,null,"De tarieven zijn van toepassing van 1 januari 2021 tot 31 december 2021."]
[]
[null,null,null,"De simulatie kan gehanteerd worden voor netgebruikers die direct aangesloten zijn op het Elia-net,"]
[null,null,null,"met of zonder lokale productie in hetzelfde toegangspunt.  De simulatie is niet bedoeld voor distributienetbeheerders."]
[]
[null,null,null,"De simulatie is niet bedoeld voor offshore toegangspunten die zijn aangesloten op de MOG en toegangspunten uit het GD Luxemburg. Neem contact op met uw KAM als u een simulatie voor deze toegangspunten wilt ontvangen."]
[]
[null,null,null,"Voor het bekomen van een simulatie dienen vooreerst de profielkarakteristieken van de toegang ingevoerd"]
[null,null,null,"te worden in het blad “Gegevens”. De resultaten kunnen vervolgens bekeken worden op het blad"]
[null,null,null,"“Resultaten I” (tarieven van toepassing op het betrokken toegangspunt) en “Resultaten II” (bedragen met"]
[null,null,null,"betrekking tot de termen voor toegang tot het net, de openbare dienstverplichtingen en de toeslagen voor "]
[null,null,null,"het betrokken toegangspunt)."]
[]
[]
[null,null,null,"(*)   Buiten het tarief voor bijkomende levering van reactieve energie en het tarief voor eventuele"]
[null,null,null,"overschrijding van het ter beschikking gestelde vermogen."]
[]
[]
[null,null,null,"Disclaimer :"]
[]
[null,null,null,"Het hierboven weergegeven hulpmiddel en de daarin vervatte informatie en tarieven worden enkel "]
[null,null,null,"meegedeeld voor informatieve doeleinden en beogen de berekening van de kostprijs voor toegang tot het"]
[null,null,null,"net voor een gegeven toegangspunt voor een netgebruiker te vergemakkelijken. Echter, noch de"]
[null,null,null,"opgegeven informatie en tarieven noch de berekende resultaten zijn van contractuele aard. Zij vormen"]
[null,null,null,"geen aanbod tot het sluiten van een contract en kunnen Elia niet binden noch van Elia worden"]
[null,null,null,"afgedwongen. "]
[]
[null,null,null,"ELIA verstrekt geen enkele garantie over het adequaat karakter, de accuraatheid, de volledigheid en de"]
[null,null,null,"correctheid van de verschafte en/of de berekende informatie noch over de geldigheidsduur van de"]
[null,null,null,"weergeven tarieven. ELIA zal dan ook niet aansprakelijk zijn voor de gevolgen voortvloeiend uit het"]
[null,null,null,"eventueel niet volledig of correct zijn of het up to date zijn van de verschafte informatie en de tarieven."]

{"sheet":"Gegevens","index":1,"n_rows":97,"n_cols":10,"rows_kept":97,"cut":false,"hidden":false,"merged":[[91,6,91,8],[72,8,72,10],[66,8,66,10],[67,8,67,10],[68,8,68,10],[69,8,69,10],[70,8,70,10],[71,8,71,10],[65,8,65,10],[47,6,47,10],[64,8,64,10],[7,10,9,10],[61,8,61,10],[62,8,62,10],[63,8,63,10],[13,7,13,10],[25,9,25,11],[26,9,26,11],[27,9,27,11],[35,9,35,11],[36,9,36,11],[9,5,9,9],[11,5,11,6],[13,5,13,6]]}
[]
[]
[null,null,"  Gegevens in te vullen door de gebruiker"]
[]
[null,null,null,"1. Karakteristieken van het toegangspunt"]
[]
[null,null,null,null,"Vul hierna het infrastructuurniveau, de regio en het type toegangspunt in."]
[]
[]
[null,null,null,null,"Infrastructuurniveau :","In 380/220/150 kV-netten"]
[]
[null,null,null,null,"Regio :  ","Het Brussels Gewest"]
[]
[null,null,null,null,"Type toegangspunt :","Hoofdtoegangspunt"]
[]
[null,null,null,"2. Netto afgename piek (in MW)"]
[]
[null,null,null,null,"Vul hierna de pieken voor afname in per maand (kolom A)."]
[null,null,null,null,"Vul eveneens de pieken voor afname in tijdens de uren 17 tot 20, buiten weekend en feestdagen, "]
[null,null,null,null,"enkel voor de maanden januari tot maart en november tot december (kolom B)."]
[]
[null,null,null,null,"N.B. : Per maand is de waarde in kolom B minstens gelijk aan de waarde in kolom A voor het jaar 2020."]
[]
[]
[null,null,null,null,null,"A\n(jaar 2020)","B\n(jaar 2019)","B\n(jaar 2020)","Jaarpiek"]
[null,null,null,null,"Januari",null,null,null,{"$f":"MAX($G$27:$G$37,H26)","v":0},{"$f":"IF(H26>F26,\"Combinatie pieken A en B NOK\",\"\")","v":""}]
[null,null,null,null,"Februari",null,null,null,{"$f":"MAX($G28:$G$37,H$26:H27)","v":0},{"$f":"IF(H27>F27,\"Combinatie pieken A en B NOK\",\"\")","v":""}]
[null,null,null,null,"Maart",null,null,null,{"$f":"MAX($G29:$G$37,H$26:H28)","v":0},{"$f":"IF(H28>F28,\"Combinatie pieken A en B NOK\",\"\")","v":""}]
[null,null,null,null,"April",null,null,null,{"$f":"MAX($G30:$G$37,H$26:H29)","v":0}]
[null,null,null,null,"Mei",null,null,null,{"$f":"MAX($G31:$G$37,H$26:H30)","v":0}]
[null,null,null,null,"Juni",null,null,null,{"$f":"MAX($G32:$G$37,H$26:H31)","v":0}]
[null,null,null,null,"Juli",null,null,null,{"$f":"MAX($G33:$G$37,H$26:H32)","v":0}]
[null,null,null,null,"Augustus",null,null,null,{"$f":"MAX($G34:$G$37,H$26:H33)","v":0}]
[null,null,null,null,"September",null,null,null,{"$f":"MAX($G35:$G$37,H$26:H34)","v":0}]
[null,null,null,null,"Oktober",null,null,null,{"$f":"MAX($G36:$G$37,H$26:H35)","v":0}]
[null,null,null,null,"November",null,null,null,{"$f":"MAX($G37:$G$37,H$26:H36)","v":0},{"$f":"IF(H36>F36,\"Combinatie pieken A en B NOK\",\"\")","v":""}]
[null,null,null,null,"December",null,null,null,{"$f":"MAX(H$26:H37)","v":0},{"$f":"IF(H37>F37,\"Combinatie pieken A en B NOK\",\"\")","v":""}]
[]
[]
[null,null,null,"3. Ter beschikking gestelde vermogen (in MVA)"]
[]
[null,null,null,null,"Vul hierna het ter beschikking gestelde vermogen bij afname in."]
[]
[null,null,null,null,"N.B. : Het ter beschikking gestelde vermogen moet minstens gelijk zijn aan het maximum van de afgenomen"]
[null,null,null,null,"         piek van het jaar. Het ter beschikking gestelde vermogen moet rekening houden met het vermogen van de "]
[null,null,null,null,"         achterliggende installaties."]
[]
[null,null,null,null,null,null,{"$f":"IF(F48<MAX(F26:F37),\"        Fout: lager dan de maximale piek 2019\",\"\")","v":""}]
[]
[]
[null,null,null,"4. Netto afgenomen energie (in MWh)"]
[]
[null,null,null,null,"Vul hierna de netto afgenomen energie in per maand."]
[]
[null,null,null,null,"Indien u wenst, kunt u een gebruiks-% inbrengen voor de automatische berekening van de maandelijkse energie"]
[null,null,null,null,"op basis van de netto afgenomen pieken hierboven ingevuld en vervolgens op de knop klikken."]
[]
[null,null,null,null,null,1]
[]
[]
[null,null,null,null,null,"Aantal uren per maand","Maximale maandelijkse energie","Afgenomen energie"]
[null,null,null,null,"Januari",744,{"$f":"F26*F62","v":0},null,{"$f":"IF(H62>G62,\"Energie en piek onverenigbaar\",\"\")","v":""}]
[null,null,null,null,"Februari",696,0,null,{"$f":"IF(H63>G63,\"Energie en piek onverenigbaar\",\"\")","v":""}]
[null,null,null,null,"Maart",743,0,null,""]
[null,null,null,null,"April",720,0,null,""]
[null,null,null,null,"Mei",744,0,null,""]
[null,null,null,null,"Juni",720,0,null,""]
[null,null,null,null,"Juli",744,0,null,""]
[null,null,null,null,"Augustus",744,0,null,""]
[null,null,null,null,"September",720,0,null,""]
[null,null,null,null,"Oktober",745,0,null,""]
[null,null,null,null,"November",720,0,null,""]
[null,null,null,null,"December",744,0,null,""]
[null,null,null,null,null,null,null,{"$f":"SUM(H62:H73)","v":0}]
[]
[]
[null,null,null,"5. Netto geïnjecteerde energie (en MWh)"]
[]
[null,null,null,null,"Vul hierna de netto geïnjecteerde energie in voor een jaar, indien van toepassing."]
[]
{"$rows_left_out":18}
{"sheet":"Resultaten I","index":2,"n_rows":68,"n_cols":5,"rows_kept":68,"cut":false,"hidden":false,"merged":[]}
[]
[]
[null,"Tarieven voor :"]
[null,"Type klant :","Klant direct aan het Elia-net aangesloten"]
[null,"Infrastructuurniveau : ",{"$f":"D_Tension","v":"In 380/220/150 kV-netten"}]
[null,"Regio : ",{"$f":"D_Region","v":"Het Brussels Gewest"}]
[null,"Type toegangspunt :",{"$f":"D_Type","v":"Hoofdtoegangspunt"}]
[]
[]
[]
[null,"A. Tarieven voor het beheer en de ontwikkeling van de netinfrastructuur "]
[]
[null,null,null,"€/kW netto afgenomen per maand"]
[null,null,"1. Tarief voor de maandpiek voor afname",{"$f":"VLOOKUP($C$5,Tarieven!D9:F11,3,FALSE)","v":0.2157}]
[]
[null,null,null,"€/kW netto afgenomen per jaar"]
[null,null,"2. Tarief voor de jaarpiek voor afname",{"$f":"VLOOKUP($C$5,Tarieven!D16:F18,3,FALSE)","v":5.6881000000000004}]
[]
[null,null,null,"€/kVA voor afname per jaar"]
[null,null,"3. Tarief voor het ter beschikking gestelde vermogen voor afname",{"$f":"IF($C$7=\"Hoofdtoegangspunt\",VLOOKUP($C$5,Tarieven!D24:G26,3,FALSE),VLOOKUP($C$5,Tarieven!D24:H26,4,FALSE))","v":4.4843999999999999}]
[]
[null,"B. Tarief voor het beheer van het elektrisch systeem"]
[null,null,null,"€/kW netto afgenomen"]
[null,null,null,{"$f":"VLOOKUP($C$5,Tarieven!D32:F34,3,FALSE)","v":0.92679999999999996}]
[]
[null,"C. Tarieven voor de vermogensreserves en de black start"]
[null,null,null,"€/MWh netto afgenomen"]
[null,null,"1. voor de afname",{"$f":"VLOOKUP($C$5,Tarieven!D41:F43,3,FALSE)","v":0.69289999999999996}]
[]
[null,null,null,"€/MWh netto geïnjecteerd"]
[null,null,"2. voor de injectie",{"$f":"VLOOKUP($C$5,Tarieven!D47:F49,3,FALSE)","v":0.6169}]
[]
[null,"D. Tarief voor integratie van de elektriciteitsmarkt"]
[null,null,null,"€/MWh netto afgenomen"]
[null,null,null,{"$f":"VLOOKUP($C$5,Tarieven!D54:F56,3,FALSE)","v":0.36670000000000003}]
[]
[null,"E. Tarieven voor Openbare Dienstverplichtingen"]
[null,null,null,"€/MWh netto afgenomen"]
[null,null,"1. Tarief voor openbare dienstverplichtingen voor de financiering van de aansluiting van offshore windturbineparken (federaal)",{"$f":"VLOOKUP($C$5,Tarieven!D63:F65,3,FALSE)","v":8.4000000000000005E-2}]
[]
[null,null,null,"€/MWh netto afgenomen"]
[null,null,"2. Tarief voor openbare dienstverplichtingen voor de financiering van groenestroomcertificaten (federaal)",{"$f":"VLOOKUP($C$5,Tarieven!D70:F72,3,FALSE)","v":11.6852}]
[]
[null,null,null,"€/MWh netto afgenomen"]
[null,null,"3. Tarief voor openbare dienstverplichtingen voor de financiering van Strategische Reserves",{"$f":"VLOOKUP($C$5,Tarieven!D77:F79,3,FALSE)","v":5.0999999999999997E-2}]
[]
[null,null,null,"€/MWh netto afgenomen"]
[null,null,"4. Tarief voor openbare dienstverplichtingen voor de financiering van de steunmaatregelen voor hernieuwbare energie en warmtekrachtkoppeling in Vlaanderen",{"$f":"IF($C$6=\"Vlaanderen\",VLOOKUP($C$5,Tarieven!D84:F86,3,FALSE),0)","v":0}]
[]
[null,null,null,"€/MWh netto afgenomen"]
[null,null,"5. Tarief voor openbare dienstverplichtingen voor de financiering van de maatregelen ter bevordering van rationeel energiegebruik in Vlaanderen",{"$f":"IF($C$6=\"Vlaanderen\",VLOOKUP($C$5,Tarieven!D91:F93,3,FALSE),0)","v":0}]
[]
[null,null,null,"Eerste component","Tweede component"]
[null,null,null,"€/MWh netto afgenomen","€/MWh netto afgenomen"]
[null,null,"6. Tarief voor openbare dienstverplichtingen voor de financiering van de steunmaatregelen voor hernieuwbare energie in Wallonië",{"$f":"IF($C$6=\"Wallonië\",VLOOKUP($C$5,Tarieven!D99:F101,3,FALSE),0)","v":0},{"$f":"IF($C$6=\"Wallonië\",VLOOKUP($C$5,Tarieven!D99:G101,4,FALSE),0)","v":0}]
[]
[null,"F. Taksen en Toeslagen"]
[null,null,null,"€/MWh netto afgenomen"]
[null,null,"1. Federale bijdrage",{"$f":"VLOOKUP($C$5,Tarieven!D107:F109,3,FALSE)","v":3.47}]
[]
[null,null,null,"€/MWh netto afgenomen"]
[null,null,"2. Toeslag voor het gebruik van het openbaar domein in Wallonië",{"$f":"IF($C$6=\"Wallonië\",VLOOKUP($C$5,Tarieven!D114:F116,3,FALSE),0)","v":0}]
[]
[null,null,null,"€/MWh netto afgenomen"]
[null,null,"3. Toeslag retributie wegenisrecht in Brussel",{"$f":"IF($C$6=\"Het Brussels Gewest\",VLOOKUP($C$5,Tarieven!D121:F123,3,FALSE),0)","v":3.5247999999999999}]
[]
[null,null,null,"€/MWh netto afgenomen"]
[null,null,"4. Toeslag voor de taksen “masten” en “sleuven” in Vlaanderen",{"$f":"IF($C$6=\"Vlaanderen\",VLOOKUP($C$5,Tarieven!D128:F130,3,FALSE),0)","v":0}]

{"sheet":"Resultaten II","index":3,"n_rows":370,"n_cols":15,"rows_kept":370,"cut":false,"hidden":false,"merged":[[367,1,367,8],[369,1,369,8],[98,3,98,8],[104,3,104,8],[363,1,363,8],[193,4,193,8],[232,4,232,8],[359,1,359,8],[361,1,361,8],[144,3,144,8],[211,4,211,8],[278,4,278,8],[183,3,183,9]]}
[]
[null,"Resultaten"]
[]
[null,null,null,null,"Type klant :","Klant direct aan het Elia-net aangesloten"]
[null,null,null,null,"Infrastructuurniveau : ",{"$f":"D_Tension","v":"In 380/220/150 kV-netten"}]
[null,null,null,null,"Regio : ",{"$f":"D_Region","v":"Het Brussels Gewest"}]
[null,null,null,null,"Type toegangspunt :",{"$f":"D_Type","v":"Hoofdtoegangspunt"}]
[null,null,null,null,"Toegangshouder :",{"$f":"D_DA","v":"Nee"}]
[null,null,null,null,"Sectorakkoord :",{"$f":"D_AB","v":"Nee"}]
[null,null,null,null,"Convenant :",{"$f":"D_CK","v":"Nee"}]
[null,null,null,null,"Soort activiteit :",{"$f":"D_TA","v":"Ander"}]
[]
[]
[]
[null,"a. Term voor het beheer en de ontwikkeling van de netinfrastructuur :"]
[]
[null,null,"a.1) Term voor maandselijke piek :"]
[]
[null,null,null,null,null,"Maandselijke piek",null,"Tarief",null,"Bedrag"]
[null,null,null,null,"Januari",{"$f":"Gegevens!F26","v":0},"MW *",{"$f":"'Resultaten I'!$D$14","v":0.2157},"€/kW =",{"$f":"F20*H20*1000","v":0},"€"]
[null,null,null,null,"Februari",{"$f":"Gegevens!F27","v":0},"MW *",{"$f":"H20","v":0.2157},"€/kW =",{"$f":"F21*H21*1000","v":0},"€"]
[null,null,null,null,"Maart",{"$f":"Gegevens!F28","v":0},"MW *",{"$f":"H21","v":0.2157},"€/kW =",0,"€"]
[null,null,null,null,"April",{"$f":"Gegevens!F29","v":0},"MW *",0.2157,"€/kW =",0,"€"]
[null,null,null,null,"Mei",{"$f":"Gegevens!F30","v":0},"MW *",0.2157,"€/kW =",0,"€"]
[null,null,null,null,"Juni",{"$f":"Gegevens!F31","v":0},"MW *",0.2157,"€/kW =",0,"€"]
[null,null,null,null,"Juli",{"$f":"Gegevens!F32","v":0},"MW *",0.2157,"€/kW =",0,"€"]
[null,null,null,null,"Augustus",{"$f":"Gegevens!F33","v":0},"MW *",0.2157,"€/kW =",0,"€"]
[null,null,null,null,"September",{"$f":"Gegevens!F34","v":0},"MW *",0.2157,"€/kW =",0,"€"]
[null,null,null,null,"Oktober",{"$f":"Gegevens!F35","v":0},"MW *",0.2157,"€/kW =",0,"€"]
[null,null,null,null,"November",{"$f":"Gegevens!F36","v":0},"MW *",0.2157,"€/kW =",0,"€"]
[null,null,null,null,"December",{"$f":"Gegevens!F37","v":0},"MW *",0.2157,"€/kW =",0,"€"]
[]
[null,null,null,null,null,null,null,null,"Totaal term voor maandselijke piek :  ",{"$f":"SUM(J20:J31)","v":0},"€"]
[]
[]
[null,null,"a.2) Term voor jaarlijkse piek :"]
[]
[null,null,null,null,null,"Jaarlijkse piek",null,"Tarief",null,"Bedrag"]
[null,null,null,null,"Januari",{"$f":"Gegevens!I26","v":0},"MW *",{"$f":"'Resultaten I'!$D$17/12","v":0.47400833333333336},"€/kW =",{"$f":"F39*H39*1000","v":0},"€"]
[null,null,null,null,"Februari",{"$f":"Gegevens!I27","v":0},"MW *",{"$f":"H39","v":0.47400833333333336},"€/kW =",0,"€"]
[null,null,null,null,"Maart",{"$f":"Gegevens!I28","v":0},"MW *",{"$f":"H40","v":0.47400833333333336},"€/kW =",0,"€"]
[null,null,null,null,"April",{"$f":"Gegevens!I29","v":0},"MW *",0.47400833333333336,"€/kW =",0,"€"]
[null,null,null,null,"Mei",{"$f":"Gegevens!I30","v":0},"MW *",0.47400833333333336,"€/kW =",0,"€"]
[null,null,null,null,"Juni",{"$f":"Gegevens!I31","v":0},"MW *",0.47400833333333336,"€/kW =",0,"€"]
[null,null,null,null,"Juli",{"$f":"Gegevens!I32","v":0},"MW *",0.47400833333333336,"€/kW =",0,"€"]
[null,null,null,null,"Augustus",{"$f":"Gegevens!I33","v":0},"MW *",0.47400833333333336,"€/kW =",0,"€"]
[null,null,null,null,"September",{"$f":"Gegevens!I34","v":0},"MW *",0.47400833333333336,"€/kW =",0,"€"]
[null,null,null,null,"Oktober",{"$f":"Gegevens!I35","v":0},"MW *",0.47400833333333336,"€/kW =",0,"€"]
[null,null,null,null,"November",{"$f":"Gegevens!I36","v":0},"MW *",0.47400833333333336,"€/kW =",0,"€"]
[null,null,null,null,"December",{"$f":"Gegevens!I37","v":0},"MW *",0.47400833333333336,"€/kW =",0,"€"]
[]
[null,null,null,null,null,null,null,null,"Totaal term voor jaarlijkse piek :  ",{"$f":"SUM(J39:J50)","v":0},"€"]
[]
[]
[null,null,"a.3) Term voor het ter beschikking gestelde vermogen voor afname :"]
[]
[null,null,null,null,null,"Vermogen",null,"Tarief",null,"Bedrag"]
[null,null,null,null,null,{"$f":"Gegevens!$F$48","v":0},"MVA *",{"$f":"'Resultaten I'!$D$20","v":4.4843999999999999},"€/kVA",{"$f":"F58*H58*1000","v":0},"€"]
[]
[null,null,null,null,null,null,null,null,"Totaal term voor het beheer en de ontwikkeling van de netinfrastructuur : ",{"$f":"J33+J52+J58","v":0},"€"]
[]
[]
[null,"b) Term voor het beheer van het elektrisch systeem :"]
[]
[null,null,null,null,null,"Netto afgenomen energie",null,"Tarief",null,"Bedrag"]
[null,null,null,null,"Januari",{"$f":"Gegevens!H62","v":0},"MWh *",{"$f":"'Resultaten I'!D24","v":0.92679999999999996},"€/MWh =",{"$f":"F66*H66","v":0},"€"]
[null,null,null,null,"Februari",{"$f":"Gegevens!H63","v":0},"MWh *",{"$f":"H66","v":0.92679999999999996},"€/MWh =",{"$f":"F67*H67","v":0},"€"]
[null,null,null,null,"Maart",{"$f":"Gegevens!H64","v":0},"MWh *",{"$f":"H67","v":0.92679999999999996},"€/MWh =",0,"€"]
[null,null,null,null,"April",{"$f":"Gegevens!H65","v":0},"MWh *",0.92679999999999996,"€/MWh =",0,"€"]
[null,null,null,null,"Mei",{"$f":"Gegevens!H66","v":0},"MWh *",0.92679999999999996,"€/MWh =",0,"€"]
[null,null,null,null,"Juni",{"$f":"Gegevens!H67","v":0},"MWh *",0.92679999999999996,"€/MWh =",0,"€"]
[null,null,null,null,"Juli",{"$f":"Gegevens!H68","v":0},"MWh *",0.92679999999999996,"€/MWh =",0,"€"]
[null,null,null,null,"Augustus",{"$f":"Gegevens!H69","v":0},"MWh *",0.92679999999999996,"€/MWh =",0,"€"]
[null,null,null,null,"September",{"$f":"Gegevens!H70","v":0},"MWh *",0.92679999999999996,"€/MWh =",0,"€"]
[null,null,null,null,"Oktober",{"$f":"Gegevens!H71","v":0},"MWh *",0.92679999999999996,"€/MWh =",0,"€"]
[null,null,null,null,"November",{"$f":"Gegevens!H72","v":0},"MWh *",0.92679999999999996,"€/MWh =",0,"€"]
[null,null,null,null,"December",{"$f":"Gegevens!H73","v":0},"MWh *",0.92679999999999996,"€/MWh =",0,"€"]
[]
[null,null,null,null,null,null,null,null,"Totaal term voor het beheer van het elektrisch systeem : ",{"$f":"SUM(J66:J77)","v":0},"€"]
[]
{"$rows_left_out":291}
{"sheet":"Tarieven","index":4,"n_rows":130,"n_cols":7,"rows_kept":130,"cut":false,"hidden":false,"merged":[[122,3,122,4],[100,3,100,4],[106,3,106,4],[107,3,107,4],[108,3,108,4],[113,3,113,4],[114,3,114,4],[121,3,121,4],[92,3,92,4],[98,3,98,4],[99,3,99,4],[115,3,115,4],[120,3,120,4],[91,3,91,4],[64,3,64,4],[69,3,69,4],[70,3,70,4],[71,3,71,4],[76,3,76,4],[77,3,77,4],[78,3,78,4],[83,3,83,4],[84,3,84,4],[85,3,85,4],[90,3,90,4],[54,3,54,4],[42,3,42,4],[48,3,48,4],[55,3,55,4],[62,3,62,4],[17,3,17,4],[32,3,32,4],[127,3,127,4],[128,3,128,4],[129,3,129,4],[23,3,23,4],[24,3,24,4],[25,3,25,4],[31,3,31,4],[63,3,63,4],[33,3,33,4],[40,3,40,4],[41,3,41,4],[46,3,46,4],[47,3,47,4],[53,3,53,4],[8,3,8,4],[9,3,9,4],[10,3,10,4],[15,3,15,4],[16,3,16,4]]}
[]
[null,"TARIFS"]
[]
[]
[null,"A. Tarieven voor het beheer en de ontwikkeling van de netinfrastructuur  "]
[]
[null,null,"1. Tarieven voor de maandpiek voor afname"]
[null,null,null,null,null,"€/kW netto afgenomen per maand"]
[null,null,null,"In 380/220/150 kV-netten",null,0.2157]
[null,null,null,"In 70/36/30 kV-netten",null,0.38869999999999999]
[null,null,null,"Bij de uitgang van de transformaties naar Middenspanning",null,0.56320000000000003]
[]
[]
[null,null,"2. Tarieven voor de jaarpiek voor afname"]
[null,null,null,null,null,"€/kW netto afgenomen per jaar"]
[null,null,null,"In 380/220/150 kV-netten",null,5.6881000000000004]
[null,null,null,"In 70/36/30 kV-netten",null,9.9198000000000004]
[null,null,null,"Bij de uitgang van de transformaties naar Middenspanning",null,14.1214]
[]
[]
[null,null,"3. Tarieven voor het ter beschikking gestelde vermogen voor afname"]
[null,null,null,null,null,"Hoofd TP","Bijkomend TP"]
[null,null,null,null,null,"€/kVA voor afname per jaar","€/kVA voor afname per jaar"]
[null,null,null,"In 380/220/150 kV-netten",null,4.4843999999999999,0.89690000000000003]
[null,null,null,"In 70/36/30 kV-netten",null,8.6525999999999996,1.7304999999999999]
[null,null,null,"Bij de uitgang van de transformaties naar Middenspanning",null,15.8735,3.1747000000000001]
[]
[]
[null,"B. Tarieven voor het beheer van het elektrisch systeem"]
[]
[null,null,null,null,null,"€/kW netto afgenomen"]
[null,null,null,"In 380/220/150 kV-netten",null,0.92679999999999996]
[null,null,null,"In 70/36/30 kV-netten",null,1.4596]
[null,null,null,"Bij de uitgang van de transformaties naar Middenspanning",null,2.2869000000000002]
[]
[]
[null,"C. Tarieven voor de vermogensreserves en de black start"]
[]
[null,null,"1. voor de afname"]
[null,null,null,null,null,"€/MWh netto afgenomen"]
[null,null,null,"In 380/220/150 kV-netten",null,0.69289999999999996]
[null,null,null,"In 70/36/30 kV-netten",null,0.69289999999999996]
[null,null,null,"Bij de uitgang van de transformaties naar Middenspanning",null,0.69289999999999996]
[]
[null,null,"2. voor de injectie"]
[null,null,null,null,null,"€/MWh netto geïnjecteerd"]
[null,null,null,"In 380/220/150 kV-netten",null,0.6169]
[null,null,null,"In 70/36/30 kV-netten",null,0.6169]
[null,null,null,"Bij de uitgang van de transformaties naar Middenspanning",null,0.6169]
[]
[]
[null,"D. Tarieven voor integratie van de elektriciteitsmarkt"]
[null,null,null,null,null,"€/MWh netto afgenomen"]
[null,null,null,"In 380/220/150 kV-netten",null,0.36670000000000003]
[null,null,null,"In 70/36/30 kV-netten",null,0.36670000000000003]
[null,null,null,"Bij de uitgang van de transformaties naar Middenspanning",null,0.36670000000000003]
[]
[]
[null,"E. Tarieven voor Openbare Dienstverplichtingen"]
[]
[null,null,"1. Tarief voor openbare dienstverplichtingen voor de financiering van de aansluiting van offshore windturbineparken (federaal)"]
[null,null,null,null,null,"€/MWh netto afgenomen"]
[null,null,null,"In 380/220/150 kV-netten",null,8.4000000000000005E-2]
[null,null,null,"In 70/36/30 kV-netten",null,8.4000000000000005E-2]
[null,null,null,"Bij de uitgang van de transformaties naar Middenspanning",null,8.4000000000000005E-2]
[]
[]
[null,null,"2. Tarief voor de financiering van groenestroomcertificaten (federaal)"]
[null,null,null,null,null,"€/MWh netto afgenomen"]
[null,null,null,"In 380/220/150 kV-netten",null,11.6852]
[null,null,null,"In 70/36/30 kV-netten",null,11.6852]
[null,null,null,"Bij de uitgang van de transformaties naar Middenspanning",null,11.6852]
[]
[]
[null,null,"3. Tarief voor openbare dienstverplichtingen voor de financiering van Strategische Reserves (federaal)"]
[null,null,null,null,null,"€/MWh netto afgenomen"]
[null,null,null,"In 380/220/150 kV-netten",null,5.0999999999999997E-2]
[null,null,null,"In 70/36/30 kV-netten",null,5.0999999999999997E-2]
[null,null,null,"Bij de uitgang van de transformaties naar Middenspanning",null,5.0999999999999997E-2]
[]
{"$rows_left_out":50}